{"text_format":"1","workbook":"xlsx","n_sheets":6,"sheets":["説明","１）基本情報","２）お試し勤務スペース","都道府県","集計","json"],"not_rendered":{"charts":0,"images":0,"macros":1,"external_links":0,"defined_names":3,"comments":0,"pivot_tables":0},"unopened":[],"bounds":{"document_bytes":16777216,"sheet_cells":100000,"rows_first":2000,"rows_last":500,"rows_between":2000,"halvings":0,"cell_chars":16384,"cell_head_chars":4096},"cells_cut":0,"cells_raw":0,"read":"whole","date_system":"1900"}

{"sheet":"説明","index":0,"n_rows":16,"n_cols":1,"rows_kept":16,"cut":false,"hidden":false,"merged":[]}
[]
["お試し勤務等に取り組む団体のみなさま"]
[]
["レイアウト例は下のURLをご覧ください。"]
["http://www.soumu.go.jp/satellite-office/group/hyogo/mikatakami.html"]
[]
["ご用意いただくもの"]
["・自治体を紹介する画像　１枚　（JPG形式）"]
["・県内での自治体の位置を示す地図　１枚　（PNG形式）"]
["・各お試し勤務スペースを紹介する画像　各１枚　（JPG形式）"]
["※写真サイズ800px ｘ550px以上、なるべく解像度高いものでお願い致します。"]
["※横写真でお願い致します"]
[]
["入力していただくシート"]
["１）基本情報"]
["２）お試し勤務スペース"]

{"sheet":"１）基本情報","index":1,"n_rows":19,"n_cols":4,"rows_kept":19,"cut":false,"hidden":false,"merged":[]}
["お試しサテライトオフィス　団体ページ情報入力シート"]
["基本情報"]
["都道府県名",null,"例）○○県"]
["市町村名",null,"例）○○市"]
["人口",null,"人"]
["面積",null,"㎢"]
["自治体の紹介文",null,"２５０文字程度",{"$f":"LEN(B7)","v":0}]
["アクセス",null,"自治体までの交通手段と所要時間"]
["東京から",null,"例）新幹線と列車で約２時間３０分"]
["大阪から",null,"※想定がなければ空欄で結構です"]
["名古屋から"]
["希望業種",null,"例）"]
["イベント・セミナーなど",null,"例）8月3日　体験ツアー http://www.XXXXXXXXX"]
[null,null,"最大３つまで"]
[]
["お問い合わせ先",null,"例）○○市産業部商工課"]
["メールアドレス"]
["電話番号"]
[null,"※お試し勤務スペースのシートに続く"]

{"sheet":"２）お試し勤務スペース","index":2,"n_rows":50,"n_cols":4,"rows_kept":50,"cut":false,"hidden":false,"merged":[]}
["お試しサテライトオフィス　団体ページ情報入力シート"]
["お試し勤務スペース情報"]
["お試し勤務スペース名"]
["〒",null,"例）100-8926"]
["所在地",null,"例）東京都千代田区霞が関2-1-2"]
["ホームページ",null,"例）http://www.soumu.go.jp/satellite-office/"]
["設備",null,"例）Wi-Fi、駐車場○台、売店"]
["施設概要",null,"２００文字程度",{"$f":"LEN(B8)","v":0}]
["近隣施設",null,"例）スーパー（○m）、コンビニ（○m）、レストラン（○m）"]
["滞在施設",null,"例）古民家を優先的に紹介　等"]
["お試し勤務スペース名"]
["〒"]
["所在地"]
["ホームページ"]
["設備"]
["施設概要",null,null,{"$f":"LEN(B16)","v":0}]
["近隣施設"]
["滞在施設"]
["お試し勤務スペース名"]
["〒"]
["所在地"]
["ホームページ"]
["設備"]
["施設概要",null,null,{"$f":"LEN(B24)","v":0}]
["近隣施設"]
["滞在施設"]
["お試し勤務スペース名"]
["〒"]
["所在地"]
["ホームページ"]
["設備"]
["施設概要",null,null,{"$f":"LEN(B32)","v":0}]
["近隣施設"]
["滞在施設"]
["お試し勤務スペース名"]
["〒"]
["所在地"]
["ホームページ"]
["設備"]
["施設概要",null,null,{"$f":"LEN(B40)","v":0}]
["近隣施設"]
["滞在施設"]
["お試し勤務スペース名"]
["〒"]
["所在地"]
["ホームページ"]
["設備"]
["施設概要",null,null,{"$f":"LEN(B48)","v":0}]
["近隣施設"]
["滞在施設"]

{"sheet":"都道府県","index":3,"n_rows":47,"n_cols":3,"rows_kept":47,"cut":false,"hidden":false,"merged":[]}
["北海道","hokkaido","hokkaidou"]
["青森県","aomori","aomori"]
["岩手県","iwate","iwate"]
["宮城県","miyagi","miyagi"]
["秋田県","akita","akita"]
["山形県","yamagata","yamagata"]
["福島県","fukushima","fukushima"]
["茨城県","ibaraki","ibaraki"]
["栃木県","tochigi","tochigi"]
["群馬県","gunma","gunma"]
["埼玉県","saitama","saitama"]
["千葉県","chiba","chiba"]
["東京都","tokyo","tokyo"]
["神奈川県","kanagawa","kanagawa"]
["新潟県","niigata","niigata"]
["富山県","toyama","toyama"]
["石川県","ishikawa","ishikawa"]
["福井県","fukui","fukui"]
["山梨県","yamanashi","yamanashi"]
["長野県","nagano","nagano"]
["岐阜県","gifu","gifu"]
["静岡県","shizuoka","shizuoka"]
["愛知県","aichi","aichi"]
["三重県","mie","mie"]
["滋賀県","shiga","shiga"]
["京都府","kyouto","kyoto"]
["大阪府","oosaka","osaka"]
["兵庫県","hyougo","hyogo"]
["奈良県","nara","nara"]
["和歌山県","wakayama","wakayama"]
["鳥取県","tottori","tottori"]
["島根県","shimane","shimane"]
["岡山県","okayama","okayama"]
["広島県","hiroshima","hiroshima"]
["山口県","yamaguchi","yamaguchi"]
["徳島県","tokushima","tokushima"]
["香川県","kagawa","kagawa"]
["愛媛県","ehime","ehime"]
["高知県","kochi","kochi"]
["福岡県","fukuoka","fukuoka"]
["佐賀県","saga","saga"]
["長崎県","nagasaki","nagasaki"]
["熊本県","kumamoto","kumamoto"]
["大分県","ooita","oita"]
["宮崎県","miyazaki","miyazaki"]
["鹿児島県","kagoshima","kagoshima"]
["沖縄県","okinawa","okinawa"]

{"sheet":"集計","index":4,"n_rows":5,"n_cols":3,"rows_kept":5,"cut":false,"hidden":false,"merged":[[0,0,1,0]]}
["都道府県名",{"$f":"VLOOKUP('１）基本情報'!B3,都道府県!A1:B47,2,FALSE)","v":{"$error":"#N/A"}}]
[null,{"$f":"VLOOKUP('１）基本情報'!B3,都道府県!A1:C47,3,FALSE)","v":{"$error":"#N/A"}}]
["市町村名","asago","市町村名のローマ字表記"]
["都道府県市町村名",{"$f":"'１）基本情報'!B3&'１）基本情報'!B4","v":""}]
["テキスト",{"$f":"'１）基本情報'!B7","v":0}]

{"sheet":"json","index":5,"n_rows":10,"n_cols":3,"rows_kept":10,"cut":false,"hidden":false,"merged":[]}
["{"]
["data_pref: \"",{"$f":"集計!B1","v":{"$error":"#N/A"}},"\","]
["class: \"\","]
["link: \"",{"$f":"\"group/\"&集計!$B$2&\"/\"&集計!$B$3&\".html\"","v":{"$error":"#N/A"}},"\","]
["img: \"",{"$f":"\"group/\"&集計!$B$2&\"/\"&集計!$B$3&\"/\"&\"thumbnail.html\"","v":{"$error":"#N/A"}},"\","]
["place: \"",{"$f":"集計!$B$4","v":""},"\", "]
["caption: \"\", "]
["info:\"",{"$f":"LEFT(集計!$B$5,145)","v":"0"},"\","]
["text: \"",{"$f":"集計!$B$5","v":0},"\","]
["}"]